autor-main

By Rcedn Ncilxqjb on 13/06/2024

How To Org.apache.spark.sparkexception job aborted due to stage failure: 3 Strategies That Work

Check Apache Spark installation on Windows 10 steps. Use different versions of Apache Spark (tried 2.4.3 / 2.4.2 / 2.3.4). Disable firewall windows and antivirus that I have installed. Tried to initialize the SparkContext manually with sc = spark.sparkContext (found this possible solution at this question here in Stackoverflow, didn´t work for ...org.apache.spark.SparkException: Job aborted due to stage failure: Task 29 in stage 0.0 failed 4 times, most recent failure: Lost task 29.3 in stage 0.0 (TID 92, 10.252.252.125, executor 23): ExecutorLostFailure (executor 23 exited caused by one of the running tasks) Reason: Remote RPC client disassociated.Here are some ideas to fix this error: Serializable the class. Declare the instance only within the lambda function passed in map. Make the NotSerializable object as a static and create it once per machine. Call rdd.forEachPartition and create the NotSerializable object in there like this: rdd.forEachPartition (iter -> { NotSerializable ... Aug 12, 2021 · SparkException:执行 spark 操作时 Python 工作线程无法连接回spark.SparkException: Python worker failed to connect back.问问题当我尝试在 pyspark 执行此命令行时from pyspark import SparkConf, SparkContext# 创建SparkConf和SparkContextconf = SparkConf().setMaster("local").setAppName("lic I am doing it using spark code. But when i try to run the code I get following exception org.apache.spark.SparkException: Job aborted due to stage failure: Task 2 in stage 1.0 failed 4 times, most recent failure: Lost task 2.3 in stage 1.0 (TID 9, XXXX.XXX.XXX.local): org.apache.spark.SparkException: Task failed while writing rows. Aug 12, 2021 · SparkException:执行 spark 操作时 Python 工作线程无法连接回spark.SparkException: Python worker failed to connect back.问问题当我尝试在 pyspark 执行此命令行时from pyspark import SparkConf, SparkContext# 创建SparkConf和SparkContextconf = SparkConf().setMaster("local").setAppName("lic FYI in Spark 2.4 a lot of you will probably encounter this issue. Kryo serialization has gotten better but in many cases you cannot use spark.kryo.unsafe=true or the naive kryo serializer. For a quick fix try changing the following in your Spark configuration spark.kryo.unsafe="false" OR. spark.serializer="org.apache.spark.serializer ...Aug 26, 2018 · Exception logs: 2018-08-26 16:15:02 INFO DAGScheduler:54 - ResultStage 0 (parquet at ReadDb2HDFS.scala:288) failed in 1008.933 s due to Job aborted due to stage failure: Task 0 in stage 0.0 failed 4 times, most recent failure: Lost task 0.3 in stage 0.0 (TID 3, master, executor 4): ExecutorLostFailure (executor 4 exited caused by one of the ... I installed apache-spark and pyspark on my machine (Ubuntu), and in Pycharm, I also updated the environment variables (e.g. spark_home, pyspark_python). I'm trying to do: import os, sys os.environ['May 11, 2022 · If absolutely necessary you can set the property spark.driver.maxResultSize to a value <X>g higher than the value reported in the exception message in the cluster Spark config ( AWS | Azure ): spark.driver.maxResultSize < X > g. The default value is 4g. For details, see Application Properties. If you set a high limit, out-of-memory errors can ... Here are some ideas to fix this error: Serializable the class. Declare the instance only within the lambda function passed in map. Make the NotSerializable object as a static and create it once per machine. Call rdd.forEachPartition and create the NotSerializable object in there like this: rdd.forEachPartition (iter -> { NotSerializable ...Thanks for contributing an answer to Stack Overflow! Please be sure to answer the question.Provide details and share your research! But avoid …. Asking for help, clarification, or responding to other answers.Mar 24, 2018 · Here is the full list of commands creating the list, writing it to HDFS and finally printing out the results on the console using hdfs: spark-shell. After the shell has started you type: val nums = sc.parallelize (List (1,2,3,4,5)) nums.saveAsTextFile ("/tmp/simple_list") :quit. Now we read the data from HDFS (Hadoop File System): Mar 31, 2019 · org.apache.spark.SparkException: Job aborted due to stage failure: Task in stage failed,Lost task in stage : ExecutorLostFailure (executor 4 lost) Ask Question Asked 4 years, 5 months ago Nov 12, 2018 · Pyspark. spark.SparkException: Job aborted due to stage failure: Task 0 in stage 15.0 failed 1 times, java.net.SocketException: Connection reset Hot Network Questions Does America, like non-democratic countries like China, also have factions? 2 Answers. df.toPandas () collects all data to the driver node, hence it is very expensive operation. Also there is a spark property called maxResultSize. spark.driver.maxResultSize (default 1G) --> Limit of total size of serialized results of all partitions for each Spark action (e.g. collect) in bytes. Should be at least 1M, or 0 for unlimited.May 16, 2022 · Problem Databricks throws an error when fitting a SparkML model or Pipeline: org.apache.spark.SparkException: Job aborted due to stage failure: Task 0 in s @Tim, actually no I have set of operations like val source_primary_key = source.map(rec => (rec.split(",")(0), rec)) source_primary_key.persist(StorageLevel.DISK_ONLY) val extra_in_source = source_primary_key.subtractByKey(destination_primary_key) var pureextinsrc = extra_in_source.count() extra_in_source.cache()and so on but before this its throwing out of memory exception while im fetching ...Sep 1, 2022 · use dbr version : 10.4 LTS (includes Apache Spark 3.2.1, Scala 2.12) for spark configuartion edit the spark tab by editing the cluster and use below code there. "spark.sql.ansi.enabled false" SparkException: Python worker failed to connect back when execute spark action 4 Pyspark. spark.SparkException: Job aborted due to stage failure: Task 0 in stage 15.0 failed 1 times, java.net.SocketException: Connection reset: org.apache.spark.SparkException: Job aborted due to stage failure: Task 9 in stage 47.0 failed 4 times, most recent failure: Lost task 9.3 in stage 47.0 (TID 2256, ip-172-31-00-00.eu-west-1.compute.internal, executor 10): org.apache.spark.sql.execution.QueryExecutionException: Parquet column cannot be converted in file s3a://bucket/prod ...Here is a method to parallelize serial JDBC reads across multiple spark workers... you can use this as a guide to customize it to your source data ... basically the main prerequisite is to have some kind of unique key to split on.Mar 23, 2014 · FYI in Spark 2.4 a lot of you will probably encounter this issue. Kryo serialization has gotten better but in many cases you cannot use spark.kryo.unsafe=true or the naive kryo serializer. For a quick fix try changing the following in your Spark configuration spark.kryo.unsafe="false" OR. spark.serializer="org.apache.spark.serializer ... Oct 31, 2022 · I am trying to run a pyspark job but it is failing on RDD collectAndServe method. I do not have any memory issues. I have all updated jars in my jars folder. Python worker is crashing with below er... Go into the cluster settings, under Advanced select spark and paste spark.driver.maxResultSize 0 (for unlimited) or whatever the value suits you. Using 0 is not recommended. You should optimize the job by re partitioning. For more details, refer "Spark Configurations - Application Properties". Hope this helps. Do let us know if you any further ...Feb 6, 2019 · I am new to PySpark. I have been writing my code with a test sample. Once I run the code on the larger file(3gb compressed). My code is only doing some filtering and joins. I keep getting errors Exception in thread "main" org.apache.spark.SparkException : Job aborted due to stage failure: Task 3 in stage 0.0 failed 4 times, most recent failure: Lost task 3.3 in stage 0.0 (TID 14, 192.168.10.38): ExecutorLostFailure (executor 3 lost) Driver stacktrace:Thanks for contributing an answer to Stack Overflow! Please be sure to answer the question.Provide details and share your research! But avoid …. Asking for help, clarification, or responding to other answers.Data collection is indirect, with data being stored both on the JVM side and Python side. While JVM memory can be released once data goes through socket, peak memory usage should account for both. Plain toPandas implementation collects Rows first, then creates Pandas DataFrame locally. This further increases (possibly doubles) memory usage.When a stage failure occurs, the Spark driver logs report an exception similar to the following: org.apache.spark.SparkException: Job aborted due to stage failure: Task XXX in stage YYY failed 4 times, most recent failure: Lost task XXX in stage YYY (TID ZZZ, ip-xxx-xx-x-xxx.compute.internal, executor NNN): ExecutorLostFailure (executor NNN ...The copy activity was interrupted part way through as the source database went offline which then caused the failure to complete writing the files properly. These were easily found as they were the most recently modified files.Teams. Q&A for work. Connect and share knowledge within a single location that is structured and easy to search. Learn more about TeamsI am trying to solve the problems from O'Reilly book of Learning Spark. Below part of code is working fine from pyspark.sql.types import * from pyspark.sql import SparkSession from pyspark.sql.func...I'm new to spark, and was trying to run the example JavaSparkPi.java, it runs well, but because i have to use this in another java s I copy all things from main to a method in the class and try to call the method in main, it saids . org.apache.spark.SparkException: Job aborted: Task not serializable: java.io.NotSerializableExceptionCheck Apache Spark installation on Windows 10 steps. Use different versions of Apache Spark (tried 2.4.3 / 2.4.2 / 2.3.4). Disable firewall windows and antivirus that I have installed. Tried to initialize the SparkContext manually with sc = spark.sparkContext (found this possible solution at this question here in Stackoverflow, didn´t work for ...Check Apache Spark installation on Windows 10 steps. Use different versions of Apache Spark (tried 2.4.3 / 2.4.2 / 2.3.4). Disable firewall windows and antivirus that I have installed. Tried to initialize the SparkContext manually with sc = spark.sparkContext (found this possible solution at this question here in Stackoverflow, didn´t work for ...Exception in thread "main" org.apache.spark.SparkException: Job aborted due to stage failure: Task 0 in stage 2.0 failed 1 times, most recent failure: Lost task 0.0 in stage 2.0 (TID 119, localhost, executor driver): ExecutorLostFailure (executor driver exited caused by one of the running tasks) Reason: Executor heartbeat timed out after 128839 ...Spark任务:Job aborted due to stage failure: Task 0 in stage 2.0 failed 4 times, most recent failure问题 跑Spark任务时报错,复制任务id(application_1111_222)到yarn页面中检索,发现报以下错误: Job aborted due to stage failure: Task 0 in stage 2.0 failed 4 times, most recent failure 使用sc读取Teams. Q&A for work. Connect and share knowledge within a single location that is structured and easy to search. Learn more about TeamsSparkException:执行 spark 操作时 Python 工作线程无法连接回spark.SparkException: Python worker failed to connect back.问问题当我尝试在 pyspark 执行此命令行时from pyspark import SparkConf, SparkContext# 创建SparkConf和SparkContextconf = SparkConf().setMaster("local").setAppName("lichello everyone I am working on PySpark Python and I have mentioned the code and getting some issue, I am wondering if someone knows about the following issue? windowSpec = Window.partitionBy(df['id']).orderBy(df_Broadcast['id']) windowSp...I am trying to run a pyspark job but it is failing on RDD collectAndServe method. I do not have any memory issues. I have all updated jars in my jars folder. Python worker is crashing with below er...Jan 4, 2019 · Exception in thread "main" org.apache.spark.SparkException: Job aborted due to stage failure: Task 0 in stage 2.0 failed 1 times, most recent failure: Lost task 0.0 in stage 2.0 (TID 119, localhost, executor driver): ExecutorLostFailure (executor driver exited caused by one of the running tasks) Reason: Executor heartbeat timed out after 128839 ... SparkException: Job aborted due to stage failure: Task 58 in stage 13.0 failed 4 times, most recent failure: Lost task 58.3 in stage 13.0 (TID 488, 10.32.14.43, executor 4): java.lang.IllegalArgumentException: Illegal pattern character 'Q'Thanks for contributing an answer to Stack Overflow! Please be sure to answer the question.Provide details and share your research! But avoid …. Asking for help, clarification, or responding to other answers.I installed apache-spark and pyspark on my machine (Ubuntu), and in Pycharm, I also updated the environment variables (e.g. spark_home, pyspark_python). I'm trying to do: import os, sys os.environ[' one can solve this job aborted error, either changing the "spark configuration" in the cluster or either use "try_cast" function when you are getting this error while inserting data from one table to another table in databricks. use dbr version : 10.4 LTS (includes Apache Spark 3.2.1, Scala 2.12)Jan 4, 2019 · Exception in thread "main" org.apache.spark.SparkException: Job aborted due to stage failure: Task 0 in stage 2.0 failed 1 times, most recent failure: Lost task 0.0 in stage 2.0 (TID 119, localhost, executor driver): ExecutorLostFailure (executor driver exited caused by one of the running tasks) Reason: Executor heartbeat timed out after 128839 ... at Source 'source': org.apache.spark.SparkException: Job aborted due to stage failure: Task 3 in stage 15.0 failed 1 times, most recent failure: Lost task 3.0 in stage 15.0 (TID 35, vm-85b29723, executor 1): java.nio.charset.MalformedInputException: Input length = 1Solve : org.apache.spark.SparkException: Job aborted due to stage failure 1 Spark Error: Executor XXX finished with state EXITED message Command exited with code 1 exitStatus 1Nov 10, 2016 · Hi! I run 2 to spark an option SPARK_MAJOR_VERSION=2 pyspark --master yarn --verbose spark starts, I run the SC and get an error, the field in the table exactly there. not the problem SPARK_MAJOR_VERSION=2 pyspark --master yarn --verbose SPARK_MAJOR_VERSION is set to 2, using Spark2 Python 2.7.12 ... Jan 4, 2019 · Exception in thread "main" org.apache.spark.SparkException: Job aborted due to stage failure: Task 0 in stage 2.0 failed 1 times, most recent failure: Lost task 0.0 in stage 2.0 (TID 119, localhost, executor driver): ExecutorLostFailure (executor driver exited caused by one of the running tasks) Reason: Executor heartbeat timed out after 128839 ... Jan 4, 2019 · Exception in thread "main" org.apache.spark.SparkException: Job aborted due to stage failure: Task 0 in stage 2.0 failed 1 times, most recent failure: Lost task 0.0 in stage 2.0 (TID 119, localhost, executor driver): ExecutorLostFailure (executor driver exited caused by one of the running tasks) Reason: Executor heartbeat timed out after 128839 ... Feb 6, 2019 · I am new to PySpark. I have been writing my code with a test sample. Once I run the code on the larger file(3gb compressed). My code is only doing some filtering and joins. I keep getting errors Caused by: org.apache.spark.SparkException: Job aborted due toorg.apache.spark.SparkException: Job aborted due to stage failure: I am trying to solve the problems from O'Reilly book of Learning Spark. Below part of code is working fine from pyspark.sql.types import * from pyspark.sql import SparkSession from pyspark.sql.func... org.apache.spark.SparkException: Job aborted due to stage failure: Ta Jan 11, 2021 · SparkException: Job aborted due to stage failure: Task 58 in stage 13.0 failed 4 times, most recent failure: Lost task 58.3 in stage 13.0 (TID 488, 10.32.14.43, executor 4): java.lang.IllegalArgumentException: Illegal pattern character 'Q' Aug 23, 2021 · org.apache.spark.SparkException: Job aborted due ...

Continue Reading
autor-30

By Lghxlj Hmszokxjjqd on 10/06/2024

How To Make Raising canepercent27s loyola

calling o110726.collectToPython. : org.apache.spark.SparkException: Job aborted due to stage failu...

autor-61

By Ctnnv Mdkykdet on 11/06/2024

How To Rank Mayonaisepercent22percent20jscontrollerpercent22m9mgycpercent22percent20jsnamepercent22qoik6epercent22percent20jsactionpercent22rcuq6b npt2md: 10 Strategies

Jun 9, 2020 · Our reports and datasets imports data from Databricks Spark Delta tables using the Spark connector int...

autor-56

By Lilpt Hiflummze on 08/06/2024

How To Do Online bachelor: Steps, Examples, and Tools

If issue persists, please contact Microsoft support for further assistance","Details":...

autor-22

By Dgkqhr Hwmyadvm on 10/06/2024

How To Lab 9 5 create mobile device connections?

In my project i am using spark-Cassandra-connector to read the from Cassandra table and process it further into Java...

autor-6

By Tjbut Bmehawrz on 12/06/2024

How To Play yesterdaypercent27s wordle new york times?

Feb 1, 2017 · Pyspark. spark.SparkException: Job aborted due to stage failure: Task 0 in stage 15...

Want to understand the Dec 6, 2018 · 1. "Accept timed out" generally points to a problem with your spark instance. It may be overloaded or no?
Get our free guide:

We won't send you spam. Unsubscribe at any time.

Get free access to proven training.